评论列表
lifeontrip 发表于 2020年03月19日

试了下,还在从 github 上拉代码,太慢了,还经常失败。被虐了千百遍了。有没有神器推介一个呢。

sn_lele 发表于 2020年05月15日

[INFO] Thingsboard Server UI .............................. SUCCESS [01:37 min] [INFO] Thingsboard Server Tools ........................... SUCCESS [ 6.402 s] [INFO] ThingsBoard Server Application ..................... SUCCESS [ 51.310 s] [INFO] ThingsBoard Microservices .......................... SUCCESS [ 0.002 s] [INFO] ThingsBoard Docker Images .......................... SUCCESS [ 0.150 s] [INFO] ThingsBoard JavaScript Executor Microservice ....... SUCCESS [ 58.288 s] [INFO] ThingsBoard Web UI Microservice .................... FAILURE [ 0.044 s] [INFO] ThingsBoard Node Microservice ...................... SKIPPED [INFO] ThingsBoard Transport Microservices ................ SKIPPED [INFO] ThingsBoard MQTT Transport Microservice ............ SKIPPED [INFO] ThingsBoard HTTP Transport Microservice ............ SKIPPED [INFO] ThingsBoard COAP Transport Microservice ............ SKIPPED [INFO] ThingsBoard Black Box Tests ........................ SKIPPED [INFO] ------------------------------------------------------------------------ [INFO] BUILD FAILURE [INFO] ------------------------------------------------------------------------ [INFO] Total time: 05:23 min [INFO] Finished at: 2020-05-15T10:15:25+08:00 [INFO] ------------------------------------------------------------------------ [WARNING] The requested profile "nexus" could not be activated because it does not exist. [ERROR] Failed to execute goal org.apache.maven.plugins:maven-dependency-plugin:2.8:unpack (extract-web-ui) on project web-ui: Artifact has not been packaged yet. When used on reactor artifact, unpack should be executed after packaging: see MDEP-98. -> [Help 1] [ERROR] [ERROR] To see the full stack trace of the errors, re-run Maven with the -e switch. [ERROR] Re-run Maven using the -X switch to enable full debug logging. [ERROR] [ERROR] For more information about the errors and possible solutions, please read the following articles: [ERROR] [Help 1] http://cwiki.apache.org/confluence/display/MAVEN/MojoExecutionException [ERROR] [ERROR] After correcting the problems, you can resume the build with the command [ERROR] mvn -rf :web-ui

这个错误 ,大神有遇见过吗? 尝试更改工程编码但是失败了,-_-||。

sn_lele 发表于 2020年05月15日

Web UI Microservice 编译失败
[ERROR] Failed to execute goal org.apache.maven.plugins:maven-dependency-plugin:2.8:unpack (extract-web-ui) on project web-ui: Artifact has not been packaged yet. When used on reactor artifact, unpack should be executed after packaging: see MDEP-98. -> [Help 1]

xiao 发表于 2020年12月14日

Error:(154,32) java: 错误: 对于 isEmpty(? super List>), 找不到合适的方法 idea 编译报错是什么问题呢

xiao 发表于 2020年12月14日

jdk1.8.0 低版本的不可以,换成高版本就可以了

xiao 发表于 2020年12月14日

jdk1.8.0 低版本的不可以,换成高版本就可以了

lzq666 发表于 2021年08月17日

Failed to execute goal com.github.eirslett:frontend-maven-plugin:1.12.0:yarn (yarn install) on project js-executor: Failed to run task: 'yarn in stall' failed. org.apache.commons.exec.ExecuteException: Process exited with an error: 1 (Exit value: 1) -> [Help 1] 3.3 版本这种错误去哪里找呢